datacomp12m_all / shards /00000007_stats.json
jordangong's picture
Add files using upload-large-folder tool
3ac28ee verified
{
"count": 10000,
"successes": 7953,
"failed_to_download": 1954,
"failed_to_resize": 93,
"duration": 584.637779712677,
"start_time": 1730257093.4446478,
"end_time": 1730257678.0824275,
"status_dict": {
"success": 7953,
"HTTP Error 403: Forbidden": 553,
"HTTP Error 404: Not Found": 538,
"Remote end closed connection without response": 78,
"<urlopen error [Errno -5] No address associated with hostname>": 39,
"Image decoding error": 91,
"HTTP Error 410: Gone": 13,
"Use of image disallowed by X-Robots-Tag directive": 38,
"<urlopen error [Errno -2] Name or service not known>": 169,
"HTTP Error 404: Not Found on Accelerator": 25,
"<urlopen error [SSL: CERTIFICATE_VERIFY_FAILED] certificate verify failed: unable to get local issuer certificate (_ssl.c:997)>": 10,
"HTTP Error 400: Bad Request": 91,
"HTTP Error 404: Not Found served by niceshops": 4,
"HTTP Error 429: Unknown Error": 4,
"HTTP Error 404: File Not Found": 14,
"<urlopen error [SSL: CERTIFICATE_VERIFY_FAILED] certificate verify failed: Hostname mismatch, certificate is not valid for 'www.heimweewinkel.nl'. (_ssl.c:997)>": 1,
"<urlopen error [SSL: CERTIFICATE_VERIFY_FAILED] certificate verify failed: self signed certificate (_ssl.c:997)>": 7,
"HTTP Error 441: status code 441": 3,
"HTTP Error 503: Service Unavailable": 8,
"<urlopen error [SSL: TLSV1_UNRECOGNIZED_NAME] tlsv1 unrecognized name (_ssl.c:997)>": 3,
"<urlopen error [SSL: CERTIFICATE_VERIFY_FAILED] certificate verify failed: Hostname mismatch, certificate is not valid for 'cdn-0.enacademic.com'. (_ssl.c:997)>": 1,
"HTTP Error 401: Unauthorized": 3,
"HTTP Error 404: ": 23,
"<urlopen error [SSL: CERTIFICATE_VERIFY_FAILED] certificate verify failed: Hostname mismatch, certificate is not valid for 'i17.cdn.preis.de'. (_ssl.c:997)>": 1,
"<urlopen error timed out>": 39,
"The read operation timed out": 31,
"HTTP Error 502: Bad Gateway": 16,
"<urlopen error [Errno -3] Temporary failure in name resolution>": 26,
"HTTP Error 406: Not Acceptable": 8,
"HTTP Error 405: Not Allowed": 17,
"HTTP Error 522: ": 15,
"<urlopen error [SSL: CERTIFICATE_VERIFY_FAILED] certificate verify failed: Hostname mismatch, certificate is not valid for 'assets.community.lomography.com'. (_ssl.c:997)>": 1,
"timed out": 11,
"<urlopen error [SSL: WRONG_SIGNATURE_TYPE] wrong signature type (_ssl.c:997)>": 1,
"HTTP Error 441: ": 2,
"<urlopen error [SSL: CERTIFICATE_VERIFY_FAILED] certificate verify failed: Hostname mismatch, certificate is not valid for 'www.news.virginia.edu'. (_ssl.c:997)>": 1,
"<urlopen error [Errno 111] Connection refused>": 16,
"HTTP Error 308: Permanent Redirect": 11,
"<urlopen error [Errno 113] No route to host>": 7,
"HTTP Error 525: ": 3,
"<urlopen error [Errno 101] Network is unreachable>": 5,
"HTTP Error 500: Internal Server Error": 12,
"<urlopen error [SSL: CERTIFICATE_VERIFY_FAILED] certificate verify failed: Hostname mismatch, certificate is not valid for 'www.reviewgeek.com'. (_ssl.c:997)>": 1,
"<urlopen error [SSL: CERTIFICATE_VERIFY_FAILED] certificate verify failed: Hostname mismatch, certificate is not valid for 'hubpng.com'. (_ssl.c:997)>": 1,
"<urlopen error [SSL: CERTIFICATE_VERIFY_FAILED] certificate verify failed: Hostname mismatch, certificate is not valid for 'www.bigrigstereo.com'. (_ssl.c:997)>": 1,
"<urlopen error [SSL: CERTIFICATE_VERIFY_FAILED] certificate verify failed: certificate has expired (_ssl.c:997)>": 22,
"<urlopen error [SSL: CERTIFICATE_VERIFY_FAILED] certificate verify failed: Hostname mismatch, certificate is not valid for '3docean.img.customer.envatousercontent.com'. (_ssl.c:997)>": 2,
"HTTP Error 520: ": 10,
"HTTP Error 301: The HTTP server returned a redirect error that would lead to an infinite loop.\nThe last 30x error message was:\nMoved Permanently": 5,
"HTTP Error 503: Service Temporarily Unavailable": 2,
"<urlopen error [SSL: CERTIFICATE_VERIFY_FAILED] certificate verify failed: Hostname mismatch, certificate is not valid for 'img.xshoppy.shop'. (_ssl.c:997)>": 2,
"HTTP Error 500: Domain Not Found": 1,
"<urlopen error [SSL: CERTIFICATE_VERIFY_FAILED] certificate verify failed: Hostname mismatch, certificate is not valid for 'sacamaincuir.org'. (_ssl.c:997)>": 1,
"<urlopen error [SSL: CERTIFICATE_VERIFY_FAILED] certificate verify failed: Hostname mismatch, certificate is not valid for 'www.stampaddicts.com'. (_ssl.c:997)>": 1,
"HTTP Error 521: ": 5,
"<urlopen error [Errno 22] Invalid argument>": 1,
"HTTP Error 503: Loop detected": 1,
"<urlopen error [SSL: CERTIFICATE_VERIFY_FAILED] certificate verify failed: Hostname mismatch, certificate is not valid for 'www.wallpaperup.com'. (_ssl.c:997)>": 2,
"HTTP Error 405: Method Not Allowed": 4,
"HTTP Error 429: Too Many Requests": 3,
"<urlopen error [SSL: CERTIFICATE_VERIFY_FAILED] certificate verify failed: Hostname mismatch, certificate is not valid for 'm.22slides.com'. (_ssl.c:997)>": 1,
"<urlopen error [SSL: CERTIFICATE_VERIFY_FAILED] certificate verify failed: Hostname mismatch, certificate is not valid for 'cdn.worldofbuzz.com'. (_ssl.c:997)>": 1,
"HTTP Error 404: The specified blob does not exist.": 3,
"<urlopen error [SSL: TLSV1_ALERT_INTERNAL_ERROR] tlsv1 alert internal error (_ssl.c:997)>": 2,
"OpenCV(4.10.0) /io/opencv/modules/imgcodecs/src/loadsave.cpp:813: error: (-215:Assertion failed) !buf.empty() in function 'imdecode_'\n": 2,
"<urlopen error [Errno 104] Connection reset by peer>": 2,
"<urlopen error [SSL: SSLV3_ALERT_HANDSHAKE_FAILURE] sslv3 alert handshake failure (_ssl.c:997)>": 4,
"HTTP Error 422: Unprocessable Entity": 3,
"<urlopen error [SSL: CERTIFICATE_VERIFY_FAILED] certificate verify failed: Hostname mismatch, certificate is not valid for 'crawlserver.yourwebmarketing.co.uk'. (_ssl.c:997)>": 1,
"HTTP Error 404: Not found": 1,
"<urlopen error [SSL: CERTIFICATE_VERIFY_FAILED] certificate verify failed: Hostname mismatch, certificate is not valid for 'seat-skoda.caffynsparts.co.uk'. (_ssl.c:997)>": 1,
"HTTP Error 504: Gateway Timeout": 2,
"HTTP Error 523: ": 2,
"HTTP Error 530: ": 3,
"<urlopen error [SSL: CERTIFICATE_VERIFY_FAILED] certificate verify failed: Hostname mismatch, certificate is not valid for 'globalriskinsights.com'. (_ssl.c:997)>": 1,
"<urlopen error [SSL: CERTIFICATE_VERIFY_FAILED] certificate verify failed: Hostname mismatch, certificate is not valid for 'www.demerkbrouwerij.nl'. (_ssl.c:997)>": 1,
"<urlopen error [SSL: CERTIFICATE_VERIFY_FAILED] certificate verify failed: Hostname mismatch, certificate is not valid for 'glimageurl.golocall.com'. (_ssl.c:997)>": 1,
"HTTP Error 403: ": 1,
"<urlopen error [SSL: CERTIFICATE_VERIFY_FAILED] certificate verify failed: Hostname mismatch, certificate is not valid for 'www.n-tel.eu'. (_ssl.c:997)>": 1,
"HTTP Error 415: Unsupported Media Type": 1,
"<urlopen error [SSL: CERTIFICATE_VERIFY_FAILED] certificate verify failed: Hostname mismatch, certificate is not valid for 'www.charnstrom.com'. (_ssl.c:997)>": 1,
"<urlopen error [SSL: CERTIFICATE_VERIFY_FAILED] certificate verify failed: Hostname mismatch, certificate is not valid for 'content.v2.makaan.com'. (_ssl.c:997)>": 1,
"<urlopen error EOF occurred in violation of protocol (_ssl.c:997)>": 1,
"HTTP Error 401: ": 1,
"HTTP Error 404: Page Not Found": 1,
"<urlopen error [SSL: CERTIFICATE_VERIFY_FAILED] certificate verify failed: Hostname mismatch, certificate is not valid for 'res0.graysonline.com'. (_ssl.c:997)>": 1,
"<urlopen error [SSL: CERTIFICATE_VERIFY_FAILED] certificate verify failed: Hostname mismatch, certificate is not valid for 'kiiky.com'. (_ssl.c:997)>": 1,
"HTTP Error 404: NOT FOUND": 2
}
}